BDBM50192528 1-(2-(4-fluoro-3-methylphenoxy)-5-((2-(pyrrolidin-1-yl)ethyl)carbamoyl)phenyl)-3-(3-fluorophenyl)urea::CHEMBL214322
SMILES Cc1cc(Oc2ccc(cc2NC(=O)Nc2cccc(F)c2)C(=O)NCCN2CCCC2)ccc1F
InChI Key InChIKey=SUXUDRZHKMVXQJ-UHFFFAOYSA-N
Data  2 IC50
  Tab Delimited (TSV)   2D SDfile   Computed 3D by Vconf -m prep SDfile
Find this compound or compounds like it in BindingDB:
Activity Spreadsheet -- Enzyme Inhibition Constant Data from BindingDB
Found 2 hits for monomerid = 50192528
TargetMelanin-concentrating hormone receptor 1(Homo sapiens (Human))
Amgen
Curated by ChEMBL
LigandPNGBDBM50192528(1-(2-(4-fluoro-3-methylphenoxy)-5-((2-(pyrrolidin-...)
Affinity DataIC50:  6nM. Assay description: Inhibition of [125I]MCH binding to rat MCHR1 expressed in HEK293 cells by HT-SPA
In DepthDetails ArticlePubMed
TargetMelanin-concentrating hormone receptor 1(Homo sapiens (Human))
Amgen
Curated by ChEMBL
LigandPNGBDBM50192528(1-(2-(4-fluoro-3-methylphenoxy)-5-((2-(pyrrolidin-...)
Affinity DataIC50:  0.100nM. Assay description: Inhibition of [125I]MCH binding to human MCHR1 expressed in HEK293 cells by HT-SPA
In DepthDetails ArticlePubMed