BDBM50192701 1-(4-methoxyphenyl)-3-[19-methyl-3-(2-methylpropyl)-14-oxo-3,13,19,20-tetraazahexacyclo[14.7.0.0^{2,10}.0^{4,9}.0^{11,15}.0^{17,21}]tricosa-1(16),2(10),4,6,8,11(15),17,20-octaen-7-yl]urea::CHEMBL218816
SMILES COc1ccc(NC(=O)Nc2ccc3n(CC(C)C)c4c5CCc6nn(C)cc6-c5c5C(=O)NCc5c4c3c2)cc1
InChI Key InChIKey=AQTHIBWLFXHXGG-UHFFFAOYSA-N
Data  2 IC50
  Tab Delimited (TSV)   2D SDfile   Computed 3D by Vconf -m prep SDfile
Find this compound or compounds like it in BindingDB:
Activity Spreadsheet -- Enzyme Inhibition Constant Data from BindingDB
Found 2 hits for monomerid = 50192701
TargetVascular endothelial growth factor receptor 2(Homo sapiens (Human))
Cephalon
Curated by ChEMBL
LigandPNGBDBM50192701(1-(4-methoxyphenyl)-3-[19-methyl-3-(2-methylpropyl...)
Affinity DataIC50:  18nM. Assay description: Inhibition of VEGFR2
In DepthDetails ArticlePubMed
TargetAngiopoietin-1 receptor(Homo sapiens (Human))
Cephalon
Curated by ChEMBL
LigandPNGBDBM50192701(1-(4-methoxyphenyl)-3-[19-methyl-3-(2-methylpropyl...)
Affinity DataIC50:  3nM. Assay description: Inhibition of Tie2
In DepthDetails ArticlePubMed