BDBM50192818 CHEMBL3943456
SMILES CNC(=O)N1CC2CCC(C1)N2C(=O)c1ccc(Nc2nc(cs2)-c2sc(C)nc2C)nc1
InChI Key InChIKey=QLQJRYRWQSZYCI-UHFFFAOYSA-N
Data  1 IC50
  Tab Delimited (TSV)   2D SDfile   Computed 3D by Vconf -m prep SDfile
Find this compound or compounds like it in BindingDB:
Activity Spreadsheet -- Enzyme Inhibition Constant Data from BindingDB
Found 1 hit for monomerid = 50192818
TargetTransient receptor potential cation channel subfamily V member 4(Homo sapiens (Human))
Shionogi
Curated by ChEMBL
LigandPNGBDBM50192818(CHEMBL3943456)
Affinity DataIC50:  770nM. Assay description: Antagonist activity at human TRPV4 assessed as inhibition of 4alpha-PDD-induced activation
In DepthDetails ArticlePubMed