BDBM50193276 CHEMBL3916962
SMILES Cl.CN(C)CCOc1ccc(cc1)C(=C(\CCCO)c1ccccc1)\c1ccc(F)cc1F
InChI Key InChIKey=KUSKPEZRGJEQFG-KYYAMWDPSA-N
Data  1 IC50
  Tab Delimited (TSV)   2D SDfile   Computed 3D by Vconf -m prep SDfile
Find this compound or compounds like it in BindingDB:
Activity Spreadsheet -- Enzyme Inhibition Constant Data from BindingDB
Found 1 hit for monomerid = 50193276
TargetEstrogen-related receptor gamma(Homo sapiens (Human))
Daegu-Gyeongbuk Medical Innovation Foundation
Curated by ChEMBL
LigandPNGBDBM50193276(CHEMBL3916962)
Affinity DataIC50:  6.70E+3nM. Assay description: Inhibition of fluorescien-conjugated coactivator PGC1a binding to GST-tagged human ERRgamma LBD after 1 hr by TR-FRET assay
In DepthDetails ArticlePubMed