BDBM50193572 3-benzyl-1-[(dimethylamino)methyl]-6-methyl-9-phenylpyrazolo[1',5':1,6]pyrimido[4,5-d]pyridazin-4(3H)-one::CHEMBL377144
SMILES CN(C)Cc1nn(Cc2ccccc2)c(=O)c2nc(C)n3nc(cc3c12)-c1ccccc1
InChI Key InChIKey=NWOYPSQSXFBTCX-UHFFFAOYSA-N
Data  2 IC50
  Tab Delimited (TSV)   2D SDfile   Computed 3D by Vconf -m prep SDfile
Find this compound or compounds like it in BindingDB:
Activity Spreadsheet -- Enzyme Inhibition Constant Data from BindingDB
Found 2 hits for monomerid = 50193572
TargetcGMP-specific 3',5'-cyclic phosphodiesterase(Homo sapiens (Human))
Università
Curated by ChEMBL
LigandPNGBDBM50193572(3-benzyl-1-[(dimethylamino)methyl]-6-methyl-9-phen...)
Affinity DataIC50:  1.40E+3nM. Assay description: Inhibition of PDE5
In DepthDetails ArticlePubMed
TargetO43924/P16499/P18545/P35913/P51160/Q13956(Homo sapiens (Human))
Università
Curated by ChEMBL
LigandPNGBDBM50193572(3-benzyl-1-[(dimethylamino)methyl]-6-methyl-9-phen...)
Affinity DataIC50:  1.00E+3nM. Assay description: Inhibition of PDE6
In DepthDetails ArticlePubMed