BDBM50193792 3-benzyl-1-cyclohexylpyrrolidin-2-one::CHEMBL218285
SMILES O=C1C(Cc2ccccc2)CCN1C1CCCCC1
InChI Key InChIKey=DGGDICYTCJZLPW-UHFFFAOYSA-N
Data  2 IC50
  Tab Delimited (TSV)   2D SDfile   Computed 3D by Vconf -m prep SDfile
Find this compound or compounds like it in BindingDB:
Activity Spreadsheet -- Enzyme Inhibition Constant Data from BindingDB
Found 2 hits for monomerid = 50193792
Target11-beta-hydroxysteroid dehydrogenase 1(Homo sapiens (Human))
Abbott Laboratories
Curated by ChEMBL
LigandPNGBDBM50193792(3-benzyl-1-cyclohexylpyrrolidin-2-one | CHEMBL2182...)
Affinity DataIC50:  107nM. Assay description: Inhibition of human 11beta-HSD1
In DepthDetails ArticlePubMed
Target11-beta-hydroxysteroid dehydrogenase type 2(Homo sapiens (Human))
Abbott Laboratories
Curated by ChEMBL
LigandPNGBDBM50193792(3-benzyl-1-cyclohexylpyrrolidin-2-one | CHEMBL2182...)
Affinity DataIC50: >1.00E+4nM. Assay description: Inhibition of human 11beta-HSD2
In DepthDetails ArticlePubMed