BDBM50193854 CHEMBL221178::{3-(5-chloro-pyridin-2-ylcarbamoyl)-4-[4-(N,N-dimethyl-carbamimidoyl)-benzoylamino]-phenoxy}-acetic acid ethyl ester
SMILES CCOC(=O)COc1ccc(NC(=O)c2ccc(cc2)C(=N)N(C)C)c(c1)C(=O)Nc1ccc(Cl)cn1
InChI Key InChIKey=JITBHWXQCWARKL-UHFFFAOYSA-N
Data  1 KI
  Tab Delimited (TSV)   2D SDfile   Computed 3D by Vconf -m prep SDfile
Find this compound or compounds like it in BindingDB:
Activity Spreadsheet -- Enzyme Inhibition Constant Data from BindingDB
Found 1 hit for monomerid = 50193854
TargetPotassium voltage-gated channel subfamily H member 2(Homo sapiens (Human))
Portola Pharmaceuticals
Curated by ChEMBL
LigandPNGBDBM50193854(CHEMBL221178 | {3-(5-chloro-pyridin-2-ylcarbamoyl)...)
Affinity DataKi:  970nM. Assay description: Displacement of [3H]dofetilide from human ERG potassium channel expressed in HEK293 cells
In DepthDetails ArticlePubMed