BDBM50194148 (2R,3R,4S,5R)-4-(allylthio)-1-(3,4-dihydroxy-5-(diphosphoryloxymethyl)tetrahydrofuran-2-yl)pyrimidin-2(1H)-one ammonium salt
SMILES O[C@@H]1[C@@H](COP(O)(=O)OP(O)(O)=O)O[C@H]([C@@H]1O)n1ccc(SCC=C)nc1=O
InChI Key InChIKey=FCNUIFOCIBZHHC-QCNRFFRDSA-N
Data  1 EC50
  Tab Delimited (TSV)   2D SDfile   Computed 3D by Vconf -m prep SDfile
Find this compound or compounds like it in BindingDB:
Activity Spreadsheet -- Enzyme Inhibition Constant Data from BindingDB
Found 1 hit for monomerid = 50194148
TargetP2Y purinoceptor 6(Homo sapiens (Human))
National Institute Of Diabetes And Digestive And Kidney Diseases
Curated by ChEMBL
LigandPNGBDBM50194148((2R,3R,4S,5R)-4-(allylthio)-1-(3,4-dihydroxy-5-(di...)
Affinity DataEC50:  560nM. Assay description: Agonist activity at human recombinant P2Y6 receptor expressed in 1321N1 cells assessed as PLC-mediated [3H]IP production
In DepthDetails ArticlePubMed