BDBM50194413 (S)-2-chloro-N-(1-(methylamino)-1-oxo-3-phenylpropan-2-yl)-4H-thieno[3,2-b]pyrrole-5-carboxamide::CHEMBL373748
SMILES CNC(=O)[C@H](Cc1ccccc1)NC(=O)c1cc2sc(Cl)cc2[nH]1
InChI Key InChIKey=RLPOXPBCQLSXLT-LBPRGKRZSA-N
Data  1 IC50
  Tab Delimited (TSV)   2D SDfile   Computed 3D by Vconf -m prep SDfile
Find this compound or compounds like it in BindingDB:
Activity Spreadsheet -- Enzyme Inhibition Constant Data from BindingDB
Found 1 hit for monomerid = 50194413
TargetGlycogen phosphorylase, liver form(Homo sapiens (Human))
Astrazeneca
Curated by ChEMBL
LigandPNGBDBM50194413((S)-2-chloro-N-(1-(methylamino)-1-oxo-3-phenylprop...)
Affinity DataIC50:  577nM. Assay description: Inhibition of recombinant human liver GPa by multienzyme coupled assay
In DepthDetails ArticlePubMed