BDBM50194632 3-{4-[3-(2-benzoyl-4-ethyl-phenoxy)-hexyloxy]-2-methyl-phenyl}-propionic acid::CHEMBL212023
SMILES CCCC(CCOc1ccc(CCC(O)=O)c(C)c1)Oc1ccc(CC)cc1C(=O)c1ccccc1
InChI Key InChIKey=YLVMSBDGHFKFGT-UHFFFAOYSA-N
Data  2 IC50  2 EC50
  Tab Delimited (TSV)   2D SDfile   Computed 3D by Vconf -m prep SDfile
Find this compound or compounds like it in BindingDB:
Activity Spreadsheet -- Enzyme Inhibition Constant Data from BindingDB
Found 4 hits for monomerid = 50194632
TargetPeroxisome proliferator-activated receptor gamma(Homo sapiens (Human))
Eli Lilly
Curated by ChEMBL
LigandPNGBDBM50194632(3-{4-[3-(2-benzoyl-4-ethyl-phenoxy)-hexyloxy]-2-me...)
Affinity DataIC50:  417nM. Assay description: Displacement of [3H]2-methyl-2-(4-{3-[propyl-(5-pyridin-2-yl-thiophene-2-sulfonyl)-amino]-propyl}-phenoxy)-propionic acid from human PPARgamma by SPA
In DepthDetails ArticlePubMed
TargetPeroxisome proliferator-activated receptor delta(Homo sapiens (Human))
Eli Lilly
Curated by ChEMBL
LigandPNGBDBM50194632(3-{4-[3-(2-benzoyl-4-ethyl-phenoxy)-hexyloxy]-2-me...)
Affinity DataEC50:  52nM. Assay description: Transactivation of human PPARdelta in CV1 cells by luciferase reporter gene assay
In DepthDetails ArticlePubMed
TargetPeroxisome proliferator-activated receptor delta(Homo sapiens (Human))
Eli Lilly
Curated by ChEMBL
LigandPNGBDBM50194632(3-{4-[3-(2-benzoyl-4-ethyl-phenoxy)-hexyloxy]-2-me...)
Affinity DataIC50:  9nM. Assay description: Displacement of [3H]2-(4-{2-[3-(2,4-difluoro-phenyl)-1-heptyl-ureido]-ethyl}-phenoxy)-2-methyl-butyric acid from human PPARdelta by SPA
In DepthDetails ArticlePubMed
TargetPeroxisome proliferator-activated receptor gamma(Homo sapiens (Human))
Eli Lilly
Curated by ChEMBL
LigandPNGBDBM50194632(3-{4-[3-(2-benzoyl-4-ethyl-phenoxy)-hexyloxy]-2-me...)
Affinity DataEC50:  968nM. Assay description: Transactivation of human PPARgamma in CV1 cells by luciferase reporter gene assay
In DepthDetails ArticlePubMed