BDBM50194636 (S)-3-{4-[3-(2-benzoyl-4-ethyl-phenoxy)-butoxy]2-methyl-phenyl}propionic acid::CHEMBL215126
SMILES CCc1ccc(O[C@@H](C)CCOc2ccc(CCC(O)=O)c(C)c2)c(c1)C(=O)c1ccccc1
InChI Key InChIKey=ONHBOWNRMGRYNP-NRFANRHFSA-N
Data  2 IC50  2 EC50
  Tab Delimited (TSV)   2D SDfile   Computed 3D by Vconf -m prep SDfile
Find this compound or compounds like it in BindingDB:
Activity Spreadsheet -- Enzyme Inhibition Constant Data from BindingDB
Found 4 hits for monomerid = 50194636
TargetPeroxisome proliferator-activated receptor delta(Homo sapiens (Human))
Eli Lilly
Curated by ChEMBL
LigandPNGBDBM50194636((S)-3-{4-[3-(2-benzoyl-4-ethyl-phenoxy)-butoxy]2-m...)
Affinity DataEC50:  339nM. Assay description: Transactivation of human PPARdelta in CV1 cells by luciferase reporter gene assay
In DepthDetails ArticlePubMed
TargetPeroxisome proliferator-activated receptor delta(Homo sapiens (Human))
Eli Lilly
Curated by ChEMBL
LigandPNGBDBM50194636((S)-3-{4-[3-(2-benzoyl-4-ethyl-phenoxy)-butoxy]2-m...)
Affinity DataIC50:  183nM. Assay description: Displacement of [3H]2-(4-{2-[3-(2,4-difluoro-phenyl)-1-heptyl-ureido]-ethyl}-phenoxy)-2-methyl-butyric acid from human PPARdelta by SPA
In DepthDetails ArticlePubMed
TargetPeroxisome proliferator-activated receptor gamma(Homo sapiens (Human))
Eli Lilly
Curated by ChEMBL
LigandPNGBDBM50194636((S)-3-{4-[3-(2-benzoyl-4-ethyl-phenoxy)-butoxy]2-m...)
Affinity DataIC50:  1.13E+3nM. Assay description: Displacement of [3H]2-methyl-2-(4-{3-[propyl-(5-pyridin-2-yl-thiophene-2-sulfonyl)-amino]-propyl}-phenoxy)-propionic acid from human PPARgamma by SPA
In DepthDetails ArticlePubMed
TargetPeroxisome proliferator-activated receptor gamma(Homo sapiens (Human))
Eli Lilly
Curated by ChEMBL
LigandPNGBDBM50194636((S)-3-{4-[3-(2-benzoyl-4-ethyl-phenoxy)-butoxy]2-m...)
Affinity DataEC50:  674nM. Assay description: Transactivation of human PPARgamma in CV1 cells by luciferase reporter gene assay
In DepthDetails ArticlePubMed