BDBM50194812 CHEMBL220287::N-(4-fluorobenzyl)-4-(3-methoxyphenyl)-6-(trifluoromethyl)pyrimidin-2-amine
SMILES COc1cccc(c1)-c1cc(nc(NCc2ccc(F)cc2)n1)C(F)(F)F
InChI Key InChIKey=MZTFCUSRGDDALU-UHFFFAOYSA-N
Data  2 KI
  Tab Delimited (TSV)   2D SDfile   Computed 3D by Vconf -m prep SDfile
Find this compound or compounds like it in BindingDB:
Activity Spreadsheet -- Enzyme Inhibition Constant Data from BindingDB
Found 2 hits for monomerid = 50194812
TargetAdenosine receptor A2a(Homo sapiens (Human))
Vernalis (R&D)
Curated by ChEMBL
LigandPNGBDBM50194812(CHEMBL220287 | N-(4-fluorobenzyl)-4-(3-methoxyphen...)
Affinity DataKi:  290nM. Assay description: Displacement of [3H]CGS21680 from human recombinant adenosine A2A receptor
In DepthDetails ArticlePubMed
TargetAdenosine receptor A1(Homo sapiens (Human))
Vernalis (R&D)
Curated by ChEMBL
LigandPNGBDBM50194812(CHEMBL220287 | N-(4-fluorobenzyl)-4-(3-methoxyphen...)
Affinity DataKi: >1.00E+4nM. Assay description: Displacement of [3H]DPCPX from recombinant adenosine A1 receptor
In DepthDetails ArticlePubMed