BDBM50194817 2-amino-4-(2-chlorophenyl)-6-phenylnicotinonitrile::CHEMBL220684
SMILES Nc1nc(cc(-c2ccccc2Cl)c1C#N)-c1ccccc1
InChI Key InChIKey=DOTFDSKMEYTLRC-UHFFFAOYSA-N
Data  2 KI
  Tab Delimited (TSV)   2D SDfile   Computed 3D by Vconf -m prep SDfile
Find this compound or compounds like it in BindingDB:
Activity Spreadsheet -- Enzyme Inhibition Constant Data from BindingDB
Found 2 hits for monomerid = 50194817
TargetAdenosine receptor A2a(Homo sapiens (Human))
Vernalis (R&D)
Curated by ChEMBL
LigandPNGBDBM50194817(2-amino-4-(2-chlorophenyl)-6-phenylnicotinonitrile...)
Affinity DataKi:  89nM. Assay description: Displacement of [3H]CGS21680 from human recombinant adenosine A2A receptor
In DepthDetails ArticlePubMed
TargetAdenosine receptor A1(Homo sapiens (Human))
Vernalis (R&D)
Curated by ChEMBL
LigandPNGBDBM50194817(2-amino-4-(2-chlorophenyl)-6-phenylnicotinonitrile...)
Affinity DataKi:  239nM. Assay description: Displacement of [3H]DPCPX from recombinant adenosine A1 receptor
In DepthDetails ArticlePubMed