BDBM50194832 7-(4-fluorophenyl)-N-(3-methylpentan-3-yl)-2,3-dihydro-1H-1,4-diazepin-5-amine::CHEMBL219265
SMILES CCC(C)(CC)NC1=NCCN=C(C1)c1ccc(F)cc1
InChI Key InChIKey=VUFNCLXJAJQINV-UHFFFAOYSA-N
Data  2 IC50
  Tab Delimited (TSV)   2D SDfile   Computed 3D by Vconf -m prep SDfile
Find this compound or compounds like it in BindingDB:
Activity Spreadsheet -- Enzyme Inhibition Constant Data from BindingDB
Found 2 hits for monomerid = 50194832
Target5-hydroxytryptamine receptor 2C(Homo sapiens (Human))
Merck Sharp And Dohme Research Laboratories
Curated by ChEMBL
LigandPNGBDBM50194832(7-(4-fluorophenyl)-N-(3-methylpentan-3-yl)-2,3-dih...)
Affinity DataIC50:  16nM. Assay description: Binding affinity to 5HT2C receptor
In DepthDetails ArticlePubMed
Target5-hydroxytryptamine receptor 2A(Homo sapiens (Human))
Merck Sharp And Dohme Research Laboratories
Curated by ChEMBL
LigandPNGBDBM50194832(7-(4-fluorophenyl)-N-(3-methylpentan-3-yl)-2,3-dih...)
Affinity DataIC50:  1.5nM. Assay description: Displacement of [3H]ketanserin from human 5HT2A receptor expressed in CHOK1 cells
In DepthDetails ArticlePubMed