BDBM50195201 3-(5-((4-acetylpiperazin-1-yl)methyl)-1H-indol-2-yl)-6-(1H-pyrazol-4-yl)quinolin-2(1H)-one::CHEMBL220653
SMILES CC(=O)N1CCN(Cc2ccc3[nH]c(cc3c2)-c2cc3cc(ccc3[nH]c2=O)-c2cn[nH]c2)CC1
InChI Key InChIKey=YZAHMIZAOIVVEF-UHFFFAOYSA-N
Data  1 IC50  1 EC50
  Tab Delimited (TSV)   2D SDfile   Computed 3D by Vconf -m prep SDfile
Find this compound or compounds like it in BindingDB:
Activity Spreadsheet -- Enzyme Inhibition Constant Data from BindingDB
Found 2 hits for monomerid = 50195201
TargetSerine/threonine-protein kinase Chk1(Homo sapiens (Human))
Merck Research Laboratories
Curated by ChEMBL
LigandPNGBDBM50195201(3-(5-((4-acetylpiperazin-1-yl)methyl)-1H-indol-2-y...)
Affinity DataEC50:  870nM. Assay description: Release of camptothecin-induced cell cycle arrest in NCI-H1299 cells mediated by CHEK1 inhibition
In DepthDetails ArticlePubMed
TargetSerine/threonine-protein kinase Chk1(Homo sapiens (Human))
Merck Research Laboratories
Curated by ChEMBL
LigandPNGBDBM50195201(3-(5-((4-acetylpiperazin-1-yl)methyl)-1H-indol-2-y...)
Affinity DataIC50:  2.5nM. Assay description: Inhibition of human CHEK1
In DepthDetails ArticlePubMed