BDBM50195332 3-(6-amino-2-(1H-benzo[d]imidazol-1-yl)pyrimidin-4-ylamino)-4-methylphenol::CHEMBL375363
SMILES Cc1ccc(O)cc1Nc1cc(N)nc(n1)-n1cnc2ccccc12
InChI Key InChIKey=KJXSQSSXPPESAI-UHFFFAOYSA-N
Data  1 IC50
  Tab Delimited (TSV)   2D SDfile   Computed 3D by Vconf -m prep SDfile
Find this compound or compounds like it in BindingDB:
Activity Spreadsheet -- Enzyme Inhibition Constant Data from BindingDB
Found 1 hit for monomerid = 50195332
TargetTyrosine-protein kinase Lck(Homo sapiens (Human))
Procter And Gamble Pharmaceuticals
Curated by ChEMBL
LigandPNGBDBM50195332(3-(6-amino-2-(1H-benzo[d]imidazol-1-yl)pyrimidin-4...)
Affinity DataIC50:  294nM. Assay description: Inhibition of human recombinant Lck by ProFlour assay
In DepthDetails ArticlePubMed