BDBM50195531 1-[2-(5-(4-chlorophenyl)-1(2,4-dichlorophenyl)-4-methyl-1H-pyrazole-3-yl)-(E)-vinyl]-piperidine::CHEMBL385964
SMILES Cc1c(\C=C\N2CCCCC2)nn(c1-c1ccc(Cl)cc1)-c1ccc(Cl)cc1Cl
InChI Key InChIKey=SPWPIJMSCDUAAC-SDNWHVSQSA-N
Data  3 KI
  Tab Delimited (TSV)   2D SDfile   Computed 3D by Vconf -m prep SDfile
Find this compound or compounds like it in BindingDB:
Activity Spreadsheet -- Enzyme Inhibition Constant Data from BindingDB
Found 3 hits for monomerid = 50195531
TargetCannabinoid receptor 1(Homo sapiens (Human))
University Of North Carolina At Greensboro
Curated by ChEMBL
LigandPNGBDBM50195531(1-[2-(5-(4-chlorophenyl)-1(2,4-dichlorophenyl)-4-m...)
Affinity DataKi:  213nM. Assay description: Displacement of [3H]SR141716 from human CB1 receptor expressed in HEK293 cells
In DepthDetails ArticlePubMed
TargetCannabinoid receptor 1(Homo sapiens (Human))
University Of North Carolina At Greensboro
Curated by ChEMBL
LigandPNGBDBM50195531(1-[2-(5-(4-chlorophenyl)-1(2,4-dichlorophenyl)-4-m...)
Affinity DataKi:  223nM. Assay description: Displacement of [3H]WIN55,212-2 from human CB1 receptor expressed in HEK293 cells
In DepthDetails ArticlePubMed
TargetCannabinoid receptor 1(Homo sapiens (Human))
University Of North Carolina At Greensboro
Curated by ChEMBL
LigandPNGBDBM50195531(1-[2-(5-(4-chlorophenyl)-1(2,4-dichlorophenyl)-4-m...)
Affinity DataKi:  258nM. Assay description: Displacement of [3H]CP55,940 from human CB1 receptor expressed in HEK293 cells
In DepthDetails ArticlePubMed