BDBM50195535 CHEMBL3968290
SMILES CC(C)(O)c1ccc(cc1)-c1cc2nc(O[C@H]3CO[C@H](CO)[C@@H](O)C3)[nH]c2cc1Cl
InChI Key InChIKey=HRYPGEFKADGMKY-VOBQZIQPSA-N
Data  1 EC50
  Tab Delimited (TSV)   2D SDfile   Computed 3D by Vconf -m prep SDfile
Find this compound or compounds like it in BindingDB:
Activity Spreadsheet -- Enzyme Inhibition Constant Data from BindingDB
Found 1 hit for monomerid = 50195535
LigandPNGBDBM50195535(CHEMBL3968290)
Affinity DataEC50:  4nM. Assay description: Activation of full length human recombinant AMPK alpha1/beta1/gamma1 expressed in baculovirus infected sf21 cells using 5'-FAM-SAMS peptide substrate...
In DepthDetails ArticlePubMed