BDBM50195702 3-[4-[2-(2-biphenyl-4-yl-5-methyl-oxazol-4-yl)-ethoxy]-2-(isopropoxycarbonylamino-methyl)-phenyl]-propionic acid::CHEMBL220622
SMILES CC(C)OC(=O)NCc1cc(OCCc2nc(oc2C)-c2ccc(cc2)-c2ccccc2)ccc1CCC(O)=O
InChI Key InChIKey=QLZAMMQCUXFOTM-UHFFFAOYSA-N
Data  4 IC50  4 EC50
  Tab Delimited (TSV)   2D SDfile   Computed 3D by Vconf -m prep SDfile
Find this compound or compounds like it in BindingDB:
Activity Spreadsheet -- Enzyme Inhibition Constant Data from BindingDB
Found 8 hits for monomerid = 50195702
TargetPeroxisome proliferator-activated receptor gamma(Homo sapiens (Human))
Eli Lilly
Curated by ChEMBL
LigandPNGBDBM50195702(3-[4-[2-(2-biphenyl-4-yl-5-methyl-oxazol-4-yl)-eth...)
Affinity DataEC50:  19nM. Assay description: Activity at human PPARgamma in CV1 cells
In DepthDetails ArticlePubMed
TargetPeroxisome proliferator-activated receptor gamma(Homo sapiens (Human))
Eli Lilly
Curated by ChEMBL
LigandPNGBDBM50195702(3-[4-[2-(2-biphenyl-4-yl-5-methyl-oxazol-4-yl)-eth...)
Affinity DataIC50:  47nM. Assay description: Displacement of [3H]2-methyl-2-(4-{3-propyl-(5-pyridin-2yl-thiophene-2-sulfonyl)-amino]-pro-pyl}-phenoxy)-propionic acid from human PPARgamma
In DepthDetails ArticlePubMed
TargetPeroxisome proliferator-activated receptor alpha(Homo sapiens (Human))
Eli Lilly
Curated by ChEMBL
LigandPNGBDBM50195702(3-[4-[2-(2-biphenyl-4-yl-5-methyl-oxazol-4-yl)-eth...)
Affinity DataIC50:  3.49E+3nM. Assay description: Displacement of [3H]2-(4-{2-[3-(2,4-difluoro-phenyl)-1-heptyl-ureido]-ethyl}-phenoxy)-2-methyl-butyric acid from hPPARalpha
In DepthDetails ArticlePubMed
TargetPeroxisome proliferator-activated receptor gamma(Homo sapiens (Human))
Eli Lilly
Curated by ChEMBL
LigandPNGBDBM50195702(3-[4-[2-(2-biphenyl-4-yl-5-methyl-oxazol-4-yl)-eth...)
Affinity DataIC50:  47nM. Assay description: Displacement of tritium labeled ligand from human PPARgamma by SPA assay
In DepthDetails ArticlePubMed
TargetPeroxisome proliferator-activated receptor alpha(Homo sapiens (Human))
Eli Lilly
Curated by ChEMBL
LigandPNGBDBM50195702(3-[4-[2-(2-biphenyl-4-yl-5-methyl-oxazol-4-yl)-eth...)
Affinity DataIC50:  3.49E+3nM. Assay description: Displacement of tritium labeled ligand from human PPARalpha by SPA assay
In DepthDetails ArticlePubMed
TargetPeroxisome proliferator-activated receptor gamma(Homo sapiens (Human))
Eli Lilly
Curated by ChEMBL
LigandPNGBDBM50195702(3-[4-[2-(2-biphenyl-4-yl-5-methyl-oxazol-4-yl)-eth...)
Affinity DataEC50:  19nM. Assay description: Displacement of tritium labeled ligand from human PPARgamma by SPA assay
In DepthDetails ArticlePubMed
TargetPeroxisome proliferator-activated receptor alpha(Homo sapiens (Human))
Eli Lilly
Curated by ChEMBL
LigandPNGBDBM50195702(3-[4-[2-(2-biphenyl-4-yl-5-methyl-oxazol-4-yl)-eth...)
Affinity DataEC50:  845nM. Assay description: Displacement of tritium labeled ligand from human PPARalpha by SPA assay
In DepthDetails ArticlePubMed
TargetPeroxisome proliferator-activated receptor alpha(Homo sapiens (Human))
Eli Lilly
Curated by ChEMBL
LigandPNGBDBM50195702(3-[4-[2-(2-biphenyl-4-yl-5-methyl-oxazol-4-yl)-eth...)
Affinity DataEC50:  845nM. Assay description: Activity at human PPARalpha in CV1 cells
In DepthDetails ArticlePubMed