BDBM50195791 CHEMBL2018158
SMILES OC(=O)c1ccc2[nH]ccc2c1
InChI Key InChIKey=IENZCGNHSIMFJE-UHFFFAOYSA-N
Data  1 IC50  1 Kd
PDB links: 2 PDB IDs match this monomer.
  Tab Delimited (TSV)   2D SDfile   Computed 3D by Vconf -m prep SDfile
Find this compound or compounds like it in BindingDB:
Activity Spreadsheet -- Enzyme Inhibition Constant Data from BindingDB
Found 2 hits for monomerid = 50195791
TargetBeta-lactamase(Klebsiella pneumoniae)
Uit The Arctic University Of Norway
Curated by ChEMBL
LigandPNGBDBM50195791(CHEMBL2018158)
Affinity DataKd:  1.38E+6nM. Assay description: Binding affinity to native signal deficient and TEV cleavage site containing His-tagged Klebsiella pneumoniae OXA-48 expressed in Escherichia coli as...
In DepthDetails ArticlePubMed
TargetBeta-lactamase(Klebsiella pneumoniae)
Uit The Arctic University Of Norway
Curated by ChEMBL
LigandPNGBDBM50195791(CHEMBL2018158)
Affinity DataIC50:  1.39E+6nM. Assay description: Inhibition of native signal containing Klebsiella pneumoniae OXA-48 using nitrocefin substrate pre-incubated for 5 mins before substrate addition
In DepthDetails ArticlePubMed