BDBM50195962 (4E,8E)-10-(hexyloxy)-N,N,4,8-tetramethyldeca-4,8-dien-1-amine::CHEMBL246993
SMILES CCCCCCOC\C=C(/C)CC\C=C(/C)CCCN(C)C
InChI Key InChIKey=DYKXYQSMPCJKBO-IRVPIMSSSA-N
Data  3 IC50
  Tab Delimited (TSV)   2D SDfile   Computed 3D by Vconf -m prep SDfile
Find this compound or compounds like it in BindingDB:
Activity Spreadsheet -- Enzyme Inhibition Constant Data from BindingDB
Found 3 hits for monomerid = 50195962
TargetLanosterol synthase(Homo sapiens (Human))
Universit£
Curated by ChEMBL
LigandPNGBDBM50195962((4E,8E)-10-(hexyloxy)-N,N,4,8-tetramethyldeca-4,8-...)
Affinity DataIC50:  850nM. Assay description: Inhibition of human oxidosqualene cyclase expressed in Pichia pastoris cells
In DepthDetails ArticlePubMed
TargetLanosterol synthase(Pneumocystis carinii)
Universit£
Curated by ChEMBL
LigandPNGBDBM50195962((4E,8E)-10-(hexyloxy)-N,N,4,8-tetramethyldeca-4,8-...)
Affinity DataIC50:  360nM. Assay description: Inhibition of Pneumocystis carinii oxidosqualene cyclase
In DepthDetails ArticlePubMed
TargetLanosterol synthase ERG7(Saccharomyces cerevisiae)
Universit£
Curated by ChEMBL
LigandPNGBDBM50195962((4E,8E)-10-(hexyloxy)-N,N,4,8-tetramethyldeca-4,8-...)
Affinity DataIC50:  1.78E+3nM. Assay description: Inhibition of Saccharomyces cervisiae oxidosqualene cyclase
In DepthDetails ArticlePubMed