BDBM50196048 CHEMBL3954877
SMILES [H][C@@]12CCCN1C(=O)[C@]1([H])CCCN1C(=O)[C@H](CC(C)C)NC(=O)[C@H](CCC(N)=O)NC(=O)[C@]1([H])CCCN1C(=O)[C@]1([H])CSCc3cc(CSC[C@H](NC2=O)C(=O)NCC(N)=O)cc(CSC[C@H](NC(=O)[C@H](C)N)C(=O)N[C@@]([H])([C@@H](C)O)C(=O)N[C@@H](CCC(N)=O)C(=O)N[C@@H](CCCNC(N)=N)C(=O)N1)c3
InChI Key InChIKey=DKFWVWGRALJJHO-QZDPODLWSA-N
Data  1 KI  1 Kd
  Tab Delimited (TSV)   2D SDfile   Computed 3D by Vconf -m prep SDfile
Find this compound or compounds like it in BindingDB:
Activity Spreadsheet -- Enzyme Inhibition Constant Data from BindingDB
Found 2 hits for monomerid = 50196048
TargetSortase family protein(Staphylococcus aureus)
Ecole Polytechnique F�D�Rale De Lausanne
Curated by ChEMBL
LigandPNGBDBM50196048(CHEMBL3954877)
Affinity DataKi:  2.40E+3nM. Assay description: Inhibition of Staphylococcus aureus His6-biotinylated SrtA expressed in Escherichia coli XL1-blue using Dabcyl-LPETG-Edans as substrate assessed as r...
In DepthDetails ArticlePubMed
TargetSortase family protein(Staphylococcus aureus)
Ecole Polytechnique F�D�Rale De Lausanne
Curated by ChEMBL
LigandPNGBDBM50196048(CHEMBL3954877)
Affinity DataKd:  1.50E+3nM. Assay description: Binding affinity to Staphylococcus aureus His6-biotinylated SrtA expressed in Escherichia coli XL1-blue using fluorescein-tagged compound after 15 mi...
In DepthDetails ArticlePubMed