BDBM50196066 20-O-Acetylneoavarol::CHEMBL516014
SMILES [H][C@@]12CCCC(=C)[C@@]1(C)CC[C@H](C)[C@@]2(C)Cc1cc(OC(C)=O)ccc1O
InChI Key InChIKey=DGNYBWKDKZPJTB-RAKGIWIYSA-N
Data  1 IC50
  Tab Delimited (TSV)   2D SDfile   Computed 3D by Vconf -m prep SDfile
Find this compound or compounds like it in BindingDB:
Activity Spreadsheet -- Enzyme Inhibition Constant Data from BindingDB
Found 1 hit for monomerid = 50196066
TargetTyrosine-protein phosphatase non-receptor type 1(Homo sapiens (Human))
Tohoku Medical And Pharmaceutical University
Curated by ChEMBL
LigandPNGBDBM50196066(20-O-Acetylneoavarol | CHEMBL516014)
Affinity DataIC50:  8.60E+3nM. Assay description: Inhibition of recombinant human PTP1B (1 to 322 residues) expressed in Escherichia coli using pNPP as substrate preincubated for 10 mins followed by ...
In DepthDetails ArticlePubMed