BDBM50196085 CHEMBL3941789
SMILES CCCCn1c2ccccc2c(O)c(C(=O)Nc2ccc(cc2)C(=O)OCCC)c1=O
InChI Key InChIKey=GZKCRVUTBBOLCK-UHFFFAOYSA-N
Data  1 EC50
  Tab Delimited (TSV)   2D SDfile   Computed 3D by Vconf -m prep SDfile
Find this compound or compounds like it in BindingDB:
Activity Spreadsheet -- Enzyme Inhibition Constant Data from BindingDB
Found 1 hit for monomerid = 50196085
TargetSmoothened homolog(Mus musculus)
Universit£
Curated by ChEMBL
LigandPNGBDBM50196085(CHEMBL3941789)
Affinity DataEC50:  800nM. Assay description: Activity at Smo in mouse C3H10T1/2 cells assessed as induction of cell differentiation into osteoblast incubated for 6 days by alkaline phosphatase a...
In DepthDetails ArticlePubMed