BDBM50196087 CHEMBL3903318
SMILES CCCCCCn1c2ccccc2c(O)c(C(=O)Nc2ccc(cc2)C(=O)OC(C)C)c1=O
InChI Key InChIKey=HRBNNUIXPOOZBK-UHFFFAOYSA-N
Data  1 EC50
  Tab Delimited (TSV)   2D SDfile   Computed 3D by Vconf -m prep SDfile
Find this compound or compounds like it in BindingDB:
Activity Spreadsheet -- Enzyme Inhibition Constant Data from BindingDB
Found 1 hit for monomerid = 50196087
TargetSmoothened homolog(Mus musculus)
Universit£
Curated by ChEMBL
LigandPNGBDBM50196087(CHEMBL3903318)
Affinity DataEC50:  6.50E+3nM. Assay description: Activity at Smo in mouse C3H10T1/2 cells assessed as induction of cell differentiation into osteoblast incubated for 6 days by alkaline phosphatase a...
In DepthDetails ArticlePubMed