BDBM50196091 CHEMBL3925255
SMILES CCCOC(=O)c1ccc(NC(=O)c2c(O)c3ccccc3n(CCC)c2=O)cc1
InChI Key InChIKey=ZKASUPWOHUOQDS-UHFFFAOYSA-N
Data  1 EC50
  Tab Delimited (TSV)   2D SDfile   Computed 3D by Vconf -m prep SDfile
Find this compound or compounds like it in BindingDB:
Activity Spreadsheet -- Enzyme Inhibition Constant Data from BindingDB
Found 1 hit for monomerid = 50196091
TargetSmoothened homolog(Mus musculus)
Universit£
Curated by ChEMBL
LigandPNGBDBM50196091(CHEMBL3925255)
Affinity DataEC50:  2.60E+3nM. Assay description: Activity at Smo in mouse C3H10T1/2 cells assessed as induction of cell differentiation into osteoblast incubated for 6 days by alkaline phosphatase a...
In DepthDetails ArticlePubMed