BDBM50196527 CHEMBL3970658::US10167270, Compound 9e
SMILES C1Cc2ccccc2C1Nc1nc(nc2ccccc12)-c1cccnc1
InChI Key InChIKey=NHFIHEPUGCTNFM-UHFFFAOYSA-N
Data  3 IC50
  Tab Delimited (TSV)   2D SDfile   Computed 3D by Vconf -m prep SDfile
Find this compound or compounds like it in BindingDB:
Activity Spreadsheet -- Enzyme Inhibition Constant Data from BindingDB
Found 3 hits for monomerid = 50196527
TargetLysosomal acid glucosylceramidase(Homo sapiens (Human))
Northwestern University Feinberg School Of Medicine
Curated by ChEMBL
LigandPNGBDBM50196527(CHEMBL3970658 | US10167270, Compound 9e)
Affinity DataIC50:  821nMpH: 5.9Assay Description:Inhibition of synthetic recombinant wild type GCase enzyme velaglucerase alfa (unknown origin) at pH 5.9 preincubated for 5 mins followed by addition...
In DepthDetails ArticlePubMed
TargetLysosomal acid glucosylceramidase(Homo sapiens (Human))
Northwestern University Feinberg School Of Medicine
Curated by ChEMBL
LigandPNGBDBM50196527(CHEMBL3970658 | US10167270, Compound 9e)
Affinity DataIC50:  821nM. Assay description: The enzyme in GCase enzyme activity buffer (25 μL/well) was added to a 384-well black plate. The fluorescent probe 3 (25 nL/well, 50 nM final co...
In DepthDetails US Patent
TargetLysosomal acid glucosylceramidase(Homo sapiens (Human))
Northwestern University Feinberg School Of Medicine
Curated by ChEMBL
LigandPNGBDBM50196527(CHEMBL3970658 | US10167270, Compound 9e)
Affinity DataIC50:  891nM. Assay description: The enzyme in GCase enzyme activity buffer (25 μL/well) was added to a 384-well black plate. The fluorescent probe 3 (25 nL/well, 50 nM final co...
In DepthDetails US Patent