BDBM50196682 CHEMBL426925::N-(1-(4-chlorobenzyl)piperidin-3-yl)-1H-indazol-5-amine::N-[1-(4-chlorobenzyl)-3-piperidyl]-N-(1H-5-indazolyl)amine
SMILES Clc1ccc(CN2CCCC(C2)Nc2ccc3[nH]ncc3c2)cc1
InChI Key InChIKey=JQCWNEXLKSGUJQ-UHFFFAOYSA-N
Data  2 IC50
  Tab Delimited (TSV)   2D SDfile   Computed 3D by Vconf -m prep SDfile
Find this compound or compounds like it in BindingDB:
Activity Spreadsheet -- Enzyme Inhibition Constant Data from BindingDB
Found 2 hits for monomerid = 50196682
TargetC-C chemokine receptor type 2(Homo sapiens (Human))
Kirin Brewery
Curated by ChEMBL
LigandPNGBDBM50196682(CHEMBL426925 | N-(1-(4-chlorobenzyl)piperidin-3-yl...)
Affinity DataIC50:  1.00E+3nM. Assay description: Inhibition of MCP1-induced cell migration in U937 cells expressing CCR2 by chemotaxis assay
In DepthDetails ArticlePubMed
TargetRho-associated protein kinase 1/2(Homo sapiens (Human))
Kirin Brewery
Curated by ChEMBL
LigandPNGBDBM50196682(CHEMBL426925 | N-(1-(4-chlorobenzyl)piperidin-3-yl...)
Affinity DataIC50:  11nM. Assay description: Inhibition of Rho kinase
In DepthDetails ArticlePubMed