BDBM50196910 CHEMBL3943625
SMILES S=C1NCC(Nc2ccc(cc2)-c2nc3ccccc3[nH]2)=N1
InChI Key InChIKey=KJVWIVDFZMCNGC-UHFFFAOYSA-N
Data  1 IC50
  Tab Delimited (TSV)   2D SDfile   Computed 3D by Vconf -m prep SDfile
Find this compound or compounds like it in BindingDB:
Activity Spreadsheet -- Enzyme Inhibition Constant Data from BindingDB
Found 1 hit for monomerid = 50196910
TargetGlycogen phosphorylase, muscle form(Oryctolagus cuniculus (rabbit))
Egypt National Research Centre
Curated by ChEMBL
LigandPNGBDBM50196910(CHEMBL3943625)
Affinity DataIC50:  5.31E+5nMpH: 6.8Assay Description:Inhibition of rabbit skeletal muscle glycogen phosphorylase b assessed as reduction in inorganic phosphate release using glucose-1-phosphate as subst...
In DepthDetails ArticlePubMed