BDBM50197012 CHEMBL429005
SMILES CC(C)C[C@H](NC(=O)[C@H](Cc1ccc(O)cc1)NC(=O)[C@H](Cc1cnc[nH]1)NC(=O)[C@H](CCCN=C(N)N)NC(=O)OCC1c2ccccc2-c2ccccc12)C(=O)N[C@@H](CC(N)=O)C(=O)N[C@@H](CC(C)C)C(=O)N[C@@H](C(C)C)C(=O)N[C@@H]([C@@H](C)O)C(=O)N[C@@H](CCCN=C(N)N)C(=O)N[C@@H](CCC(N)=O)C(=O)N[C@@H](CCCN=C(N)N)C(=O)N[C@@H](Cc1ccc(O)cc1)C(N)=O
InChI Key InChIKey=UAGOKIHKMPQLOZ-UAWNQZSRSA-N
Data  3 KI  1 EC50
  Tab Delimited (TSV)   2D SDfile   Computed 3D by Vconf -m prep SDfile
Find this compound or compounds like it in BindingDB:
Activity Spreadsheet -- Enzyme Inhibition Constant Data from BindingDB
Found 4 hits for monomerid = 50197012
TargetNeuropeptide Y receptor type 2(Homo sapiens (Human))
Bayer Pharmaceuticals
Curated by ChEMBL
LigandPNGBDBM50197012(CHEMBL429005)
Affinity DataKi:  95nM. Assay description: Displacement of human [125I]PYY from NPY2 receptor expressed in human KAN-TS cells
In DepthDetails ArticlePubMed
TargetNeuropeptide Y receptor type 5(Homo sapiens (Human))
Bayer Pharmaceuticals
Curated by ChEMBL
LigandPNGBDBM50197012(CHEMBL429005)
Affinity DataKi:  512nM. Assay description: Displacement of [125I]PYY from NPY5 receptor expressed in human HEK293 cells
In DepthDetails ArticlePubMed
TargetNeuropeptide Y receptor type 1(Homo sapiens (Human))
Bayer Pharmaceuticals
Curated by ChEMBL
LigandPNGBDBM50197012(CHEMBL429005)
Affinity DataKi: >1.00E+3nM. Assay description: Displacement of [125I]PYY from NPY1 receptor expressed in human SK-N-MC cells
In DepthDetails ArticlePubMed
TargetNeuropeptide Y receptor type 2(Homo sapiens (Human))
Bayer Pharmaceuticals
Curated by ChEMBL
LigandPNGBDBM50197012(CHEMBL429005)
Affinity DataEC50:  106nM. Assay description: Agonist activity at human NPY2 receptor expressed in human KAN-TS cells by [35S]GTPgammaS incorporation assay
In DepthDetails ArticlePubMed