BDBM50197101 CHEMBL191905
SMILES COc1cccc(COc2ccc3c4CCCc4c(=O)oc3c2)c1
InChI Key InChIKey=ROJAXROLRVQJKB-UHFFFAOYSA-N
Data  1 IC50
  Tab Delimited (TSV)   2D SDfile   Computed 3D by Vconf -m prep SDfile
Find this compound or compounds like it in BindingDB:
Activity Spreadsheet -- Enzyme Inhibition Constant Data from BindingDB
Found 1 hit for monomerid = 50197101
TargetTyrosyl-DNA phosphodiesterase 1(Homo sapiens (Human))
Siberian Branch Of The Russian Academy Of Sciences
Curated by ChEMBL
LigandPNGBDBM50197101(CHEMBL191905)
Affinity DataIC50: >1.00E+4nM. Assay description: Inhibition of recombinant Tdp1 (unknown origin) using 5'-(5,6 FAM-AAC GTC AGG GTC TTC C-BHQ1)-3' as substrate measured every 1 min by fluorescence an...
In DepthDetails ArticlePubMed