BDBM50197105 (2S,1'S,2'R)-2-(2'-Carboxycyclobutyl)glycine::CHEMBL384123
SMILES N[C@@H]([C@H]1CC[C@H]1C(O)=O)C(O)=O
InChI Key InChIKey=SRAFHGOPGVYULO-LMVFSUKVSA-N
Data  4 KI
  Tab Delimited (TSV)   2D SDfile   Computed 3D by Vconf -m prep SDfile
Find this compound or compounds like it in BindingDB:
Activity Spreadsheet -- Enzyme Inhibition Constant Data from BindingDB
Found 4 hits for monomerid = 50197105
TargetExcitatory amino acid transporter 2(Homo sapiens (Human))
University Of Berne
Curated by ChEMBL
LigandPNGBDBM50197105((2S,1'S,2'R)-2-(2'-Carboxycyclobutyl)glycine | CHE...)
Affinity DataKi:  6.60E+3nM. Assay description: Inhibition of human GLT1 expressed in Xenopus laevis Oocytes assessed as reduction of [3H]-glutamate uptake after 10 mins by scintillation counting
In DepthDetails ArticlePubMed
TargetExcitatory amino acid transporter 3(Homo sapiens (Human))
The Danish University Of Pharmaceutical Sciences
Curated by ChEMBL
LigandPNGBDBM50197105((2S,1'S,2'R)-2-(2'-Carboxycyclobutyl)glycine | CHE...)
Affinity DataKi:  5.20E+4nM. Assay description: Inhibition of human EAAT3 expressed in HEK293 cells by FLIPR membrane potential assay
In DepthDetails ArticlePubMed
TargetExcitatory amino acid transporter 2(Homo sapiens (Human))
University Of Berne
Curated by ChEMBL
LigandPNGBDBM50197105((2S,1'S,2'R)-2-(2'-Carboxycyclobutyl)glycine | CHE...)
Affinity DataKi:  1.10E+5nM. Assay description: Inhibition of human EAAT2 expressed in HEK293 cells by FLIPR membrane potential assay
In DepthDetails ArticlePubMed
TargetExcitatory amino acid transporter 1(Homo sapiens (Human))
The Danish University Of Pharmaceutical Sciences
Curated by ChEMBL
LigandPNGBDBM50197105((2S,1'S,2'R)-2-(2'-Carboxycyclobutyl)glycine | CHE...)
Affinity DataKi:  2.00E+5nM. Assay description: Inhibition of human EAAT1 expressed in HEK293 cells by FLIPR membrane potential assay
In DepthDetails ArticlePubMed