BDBM50197164 CHEMBL3921280
SMILES C[C@@H](N)C(=O)NCc1nnc(o1)-c1ccc(F)cc1
InChI Key InChIKey=ZKQYZZDOECOPDO-SSDOTTSWSA-N
Data  1 IC50
  Tab Delimited (TSV)   2D SDfile   Computed 3D by Vconf -m prep SDfile
Find this compound or compounds like it in BindingDB:
Activity Spreadsheet -- Enzyme Inhibition Constant Data from BindingDB
Found 1 hit for monomerid = 50197164
TargetHistone deacetylase 8(Homo sapiens (Human))
Acharya Nagarjuna University
Curated by ChEMBL
LigandPNGBDBM50197164(CHEMBL3921280)
Affinity DataIC50:  116nM. Assay description: Inhibition of recombinant human full length GST-tagged HDAC8 expressed in Escherichia coli DH5alpha (DE3) assessed as inhibition of deacetylation act...
In DepthDetails ArticlePubMed