BDBM50197255 CHEMBL443489::N-(2-methyl-2-phenylpropyl)-5-(piperidin-1-yl)pyrazine-2-carboxamide
SMILES CC(C)(CNC(=O)c1cnc(cn1)N1CCCCC1)c1ccccc1
InChI Key InChIKey=OEGVHXHKBRUNJJ-UHFFFAOYSA-N
Data  1 KI
  Tab Delimited (TSV)   2D SDfile   Computed 3D by Vconf -m prep SDfile
Find this compound or compounds like it in BindingDB:
Activity Spreadsheet -- Enzyme Inhibition Constant Data from BindingDB
Found 1 hit for monomerid = 50197255
TargetMetabotropic glutamate receptor 1(RAT)
Pfizer
Curated by ChEMBL
LigandPNGBDBM50197255(CHEMBL443489 | N-(2-methyl-2-phenylpropyl)-5-(pipe...)
Affinity DataKi:  17nM. Assay description: Antagonist activity at rat mGluR1a expressed in CHO cells assessed as increase in calcium internalisation by FLIPR assay
In DepthDetails ArticlePubMed