BDBM50197333 2'-({[3-(aminocarbonyl)phenyl]amino}carbonyl)-4-[({(1S)-[(dimethylamino)carbonyl]-3-methylbutyl}amino)carbonyl]biphenyl-2-carboxylic acid::CHEMBL389191
SMILES CC(C)C[C@H](NC(=O)c1ccc(c(c1)C(O)=O)-c1ccccc1C(=O)Nc1cccc(c1)C(N)=O)C(=O)N(C)C
InChI Key InChIKey=TYVBQMIVRFOXDH-VWLOTQADSA-N
Data  1 IC50
  Tab Delimited (TSV)   2D SDfile   Computed 3D by Vconf -m prep SDfile
Find this compound or compounds like it in BindingDB:
Activity Spreadsheet -- Enzyme Inhibition Constant Data from BindingDB
Found 1 hit for monomerid = 50197333
TargetCoagulation factor VII/Tissue factor(Homo sapiens (Human))
Astellas Pharma
Curated by ChEMBL
LigandPNGBDBM50197333(2'-({[3-(aminocarbonyl)phenyl]amino}carbonyl)-4-[(...)
Affinity DataIC50:  3.20E+3nM. Assay description: Inhibition of human TF/FVIIa complex by chromogenic assay
In DepthDetails ArticlePubMed