BDBM50197458 (1R)-methyl 3-(3,4-dichlorophenyl)-8-oxa-bicyclo[3.2.1]oct-2-ene-2-carboxylate::CHEMBL227654
SMILES COC(=O)C1=C(CC2CC[C@H]1O2)c1ccc(Cl)c(Cl)c1
InChI Key InChIKey=PFFMWFZKIJIGTL-WCRCJTMVSA-N
Data  2 IC50
  Tab Delimited (TSV)   2D SDfile   Computed 3D by Vconf -m prep SDfile
Find this compound or compounds like it in BindingDB:
Activity Spreadsheet -- Enzyme Inhibition Constant Data from BindingDB
Found 2 hits for monomerid = 50197458
TargetSodium-dependent dopamine transporter(Macaca fascicularis)
Organix
Curated by ChEMBL
LigandPNGBDBM50197458((1R)-methyl 3-(3,4-dichlorophenyl)-8-oxa-bicyclo[3...)
Affinity DataIC50:  4.60nM. Assay description: Displacement of [3H]WIN 35428 from DAT in rhesus monkey caudate-putamen
In DepthDetails ArticlePubMed
TargetSodium-dependent serotonin transporter(Macaca mulatta)
Organix
Curated by ChEMBL
LigandPNGBDBM50197458((1R)-methyl 3-(3,4-dichlorophenyl)-8-oxa-bicyclo[3...)
Affinity DataIC50:  2.12E+3nM. Assay description: Displacement of [3H]citalopram from SERT in rhesus monkey caudate-putamen
In DepthDetails ArticlePubMed