BDBM50198045 CHEMBL3975102
SMILES CCc1ccc(cc1)\N=C1/S\C(=C/c2ccnc(Nc3ccc(CO)cc3)c2)C(=O)N1C
InChI Key InChIKey=QXSPNZFXJSJVLX-OUGGDVFGSA-N
Data  2 IC50
  Tab Delimited (TSV)   2D SDfile   Computed 3D by Vconf -m prep SDfile
Find this compound or compounds like it in BindingDB:
Activity Spreadsheet -- Enzyme Inhibition Constant Data from BindingDB
Found 2 hits for monomerid = 50198045
TargetAurora kinase A(Homo sapiens (Human))
University Of Berne
Curated by ChEMBL
LigandPNGBDBM50198045(CHEMBL3975102)
Affinity DataIC50:  130nM. Assay description: Inhibition of His-tagged human Aurora A kinase (122 to 40 residues) expressed in Escherichia coli BL21 (DE3) Rosetta cells using biotinylated STK2 su...
In DepthDetails ArticlePubMed
TargetAurora kinase B/Inner centromere protein(Homo sapiens (Human))
University Of Berne
Curated by ChEMBL
LigandPNGBDBM50198045(CHEMBL3975102)
Affinity DataIC50:  2.60E+3nM. Assay description: Inhibition of Aurora-B/INCENP (unknown origin) using biotinylated STK2 substrate incubated for 30 mins by HTRF assay
In DepthDetails ArticlePubMed