BDBM50198315 CHEMBL3973476
SMILES OC(=O)CCC(=O)Nc1nc2ccc(NC(=O)c3cc(Br)c(Br)[nH]3)cc2s1
InChI Key InChIKey=JEJYVYOYQDMEQR-UHFFFAOYSA-N
Data  2 IC50
  Tab Delimited (TSV)   2D SDfile   Computed 3D by Vconf -m prep SDfile
Find this compound or compounds like it in BindingDB:
Activity Spreadsheet -- Enzyme Inhibition Constant Data from BindingDB
Found 2 hits for monomerid = 50198315
TargetDNA gyrase subunit B(Escherichia coli (strain K12))
University Of Ljubljana
Curated by ChEMBL
LigandPNGBDBM50198315(CHEMBL3973476)
Affinity DataIC50:  57nM. Assay description: Inhibition of Escherichia coli DNA gyrase B ATP binding site assessed as reduction in supercoiling of relaxed pNO1 DNA after 30 mins in presence of b...
In DepthDetails ArticlePubMed
TargetDNA gyrase subunit B(Staphylococcus aureus)
University Of Ljubljana
Curated by ChEMBL
LigandPNGBDBM50198315(CHEMBL3973476)
Affinity DataIC50: >1.00E+5nM. Assay description: Inhibition of Staphylococcus aureus DNA gyrase B ATP binding site assessed as reduction in supercoiling of relaxed pNO1 DNA after 30 mins in presence...
In DepthDetails ArticlePubMed