BDBM50198333 CHEMBL3920527
SMILES CCOc1ccc(Oc2ccc(cc2)-c2noc(n2)C(C)NC(C)=O)cc1
InChI Key InChIKey=YSFYOQBZOGUUIX-UHFFFAOYSA-N
Data  1 IC50  2 EC50
  Tab Delimited (TSV)   2D SDfile   Computed 3D by Vconf -m prep SDfile
Find this compound or compounds like it in BindingDB:
Activity Spreadsheet -- Enzyme Inhibition Constant Data from BindingDB
Found 3 hits for monomerid = 50198333
TargetPeroxisome proliferator-activated receptor delta(Homo sapiens (Human))
The University Of Tokyo
Curated by ChEMBL
LigandPNGBDBM50198333(CHEMBL3920527)
Affinity DataEC50:  370nM. Assay description: Agonist activity at GAL4-tagged human PPARdelta ligand binding domain chimeric receptor expressed in HEK293 cells after 24 hrs by luciferase reporter...
In DepthDetails ArticlePubMed
TargetAcetyl-CoA carboxylase 2(Homo sapiens (Human))
The University Of Tokyo
Curated by ChEMBL
LigandPNGBDBM50198333(CHEMBL3920527)
Affinity DataIC50:  420nM. Assay description: Inhibition of full length recombinant C-terminal His-tagged human ACC2 expressed in baculovirus infected sf9 cells using acetyl-CoA as substrate afte...
In DepthDetails ArticlePubMed
TargetPeroxisome proliferator-activated receptor alpha(Homo sapiens (Human))
The University Of Tokyo
Curated by ChEMBL
LigandPNGBDBM50198333(CHEMBL3920527)
Affinity DataEC50:  330nM. Assay description: Agonist activity at GAL4-tagged human PPARalpha ligand binding domain chimeric receptor expressed in HEK293 cells after 24 hrs by luciferase reporter...
In DepthDetails ArticlePubMed