BDBM50198577 (S)-1-(6-((diethylamino)methyl)-1,2,3,4-tetrahydronaphthalen-2-yl)-4-(3-(trifluoromethyl)phenethyl)piperazin-2-one::4-(3-(trifluoromethyl)phenethyl)-1-(6-((diethylamino)methyl)-1,2,3,4-tetrahydronaphthalen-2-yl)piperazin-2-one::CHEMBL214323
SMILES CCN(CC)Cc1ccc2C[C@H](CCc2c1)N1CCN(CCc2cccc(c2)C(F)(F)F)CC1=O
InChI Key InChIKey=MMYOYIKJFUXCPY-SANMLTNESA-N
Data  2 KI  2 IC50
  Tab Delimited (TSV)   2D SDfile   Computed 3D by Vconf -m prep SDfile
Find this compound or compounds like it in BindingDB:
Activity Spreadsheet -- Enzyme Inhibition Constant Data from BindingDB
Found 4 hits for monomerid = 50198577
TargetMelanin-concentrating hormone receptor 1(Homo sapiens (Human))
Procter & Gamble Pharmaceuticals
Curated by ChEMBL
LigandPNGBDBM50198577((S)-1-(6-((diethylamino)methyl)-1,2,3,4-tetrahydro...)
Affinity DataKi:  93nM. Assay description: Functional antagonism of MCH-R1 expressed in HEK293 cells
In DepthDetails ArticlePubMed
TargetMelanin-concentrating hormone receptor 1(Homo sapiens (Human))
Procter & Gamble Pharmaceuticals
Curated by ChEMBL
LigandPNGBDBM50198577((S)-1-(6-((diethylamino)methyl)-1,2,3,4-tetrahydro...)
Affinity DataKi:  93nM. Assay description: Binding affinity at MCHR1 by flash plate radioligand binding assay
In DepthDetails ArticlePubMed
TargetPotassium voltage-gated channel subfamily H member 2(Homo sapiens (Human))
Procter & Gamble Pharmaceuticals
Curated by ChEMBL
LigandPNGBDBM50198577((S)-1-(6-((diethylamino)methyl)-1,2,3,4-tetrahydro...)
Affinity DataIC50:  1.70E+3nM. Assay description: Inhibition of human ERG expressed in HEK293 cells by patch-clamp method
In DepthDetails ArticlePubMed
TargetPotassium voltage-gated channel subfamily H member 2(Homo sapiens (Human))
Procter & Gamble Pharmaceuticals
Curated by ChEMBL
LigandPNGBDBM50198577((S)-1-(6-((diethylamino)methyl)-1,2,3,4-tetrahydro...)
Affinity DataIC50:  1.70E+3nM. Assay description: Inhibition of binding to hERG
In DepthDetails ArticlePubMed