BDBM50198664 CHEMBL3954803
SMILES Fc1ccc(Cn2c(ccc2-c2ccc3oc(=O)ccc3c2)C#N)cc1
InChI Key InChIKey=VXATWIJYQKQZHY-UHFFFAOYSA-N
Data  1 IC50
  Tab Delimited (TSV)   2D SDfile   Computed 3D by Vconf -m prep SDfile
Find this compound or compounds like it in BindingDB:
Activity Spreadsheet -- Enzyme Inhibition Constant Data from BindingDB
Found 1 hit for monomerid = 50198664
TargetProgesterone receptor(Homo sapiens (Human))
Ochanomizu University
Curated by ChEMBL
LigandPNGBDBM50198664(CHEMBL3954803)
Affinity DataIC50:  210nM. Assay description: Antagonist activity at PR in human T47D cells assessed as inhibition of progesterone-induced alkaline phosphatase expression after 24 hrs by alkaline...
In DepthDetails ArticlePubMed