BDBM50198865 3-((2S,4S)-4-benzoylamino-2-pyrrolidinylcarbonyl)-1,3-thiazolidine::CHEMBL376587
SMILES O=C(N[C@@H]1CN[C@@H](C1)C(=O)N1CCSC1)c1ccccc1
InChI Key InChIKey=PPQPLQALPFUTPP-STQMWFEESA-N
Data  2 IC50
  Tab Delimited (TSV)   2D SDfile   Computed 3D by Vconf -m prep SDfile
Find this compound or compounds like it in BindingDB:
Activity Spreadsheet -- Enzyme Inhibition Constant Data from BindingDB
Found 2 hits for monomerid = 50198865
TargetDipeptidyl peptidase 4(Homo sapiens (Human))
Mitsubishi Pharma
Curated by ChEMBL
LigandPNGBDBM50198865(3-((2S,4S)-4-benzoylamino-2-pyrrolidinylcarbonyl)-...)
Affinity DataIC50: >300nM. Assay description: Inhibition of DPP4 in human plasma by fluorescence assay
In DepthDetails ArticlePubMed
TargetDipeptidyl peptidase 4(Rattus norvegicus (rat))
Mitsubishi Pharma
Curated by ChEMBL
LigandPNGBDBM50198865(3-((2S,4S)-4-benzoylamino-2-pyrrolidinylcarbonyl)-...)
Affinity DataIC50:  236nM. Assay description: Inhibition of DPP4 in rat plasma by fluorescence assay
In DepthDetails ArticlePubMed