BDBM50198882 CHEMBL3930279
SMILES COc1cc(\C=C2/SC(=S)NC2=O)cc(OC)c1O
InChI Key InChIKey=PCIQZJDFKLRXIO-UITAMQMPSA-N
Data  1 KI  1 IC50
  Tab Delimited (TSV)   2D SDfile   Computed 3D by Vconf -m prep SDfile
Find this compound or compounds like it in BindingDB:
Activity Spreadsheet -- Enzyme Inhibition Constant Data from BindingDB
Found 2 hits for monomerid = 50198882
TargetCDGSH iron-sulfur domain-containing protein 1(Homo sapiens (Human))
West Virginia University
Curated by ChEMBL
LigandPNGBDBM50198882(CHEMBL3930279)
Affinity DataKi:  191nM. Assay description: Displacement of [3H]rosiglitazone from recombinant human C-terminal His-tagged MitoNEET cytosolic domain (32 to 108 residues) expressed in Escherichi...
In DepthDetails ArticlePubMed
TargetCDGSH iron-sulfur domain-containing protein 1(Homo sapiens (Human))
West Virginia University
Curated by ChEMBL
LigandPNGBDBM50198882(CHEMBL3930279)
Affinity DataIC50:  4.47E+3nM. Assay description: Displacement of [3H]rosiglitazone from recombinant human C-terminal His-tagged MitoNEET cytosolic domain (32 to 108 residues) expressed in Escherichi...
In DepthDetails ArticlePubMed