BDBM50198902 CHEMBL3912651
SMILES Cl.C[C@]1(COCCCCOC[C@H](NC(=O)[C@@H]2CCCN2C(=O)CNC1=O)C(O)=O)NCCc1ccccc1
InChI Key InChIKey=DADIRAUWCVXPOG-JGWGOLMZSA-N
Data  1 Kd
  Tab Delimited (TSV)   2D SDfile   Computed 3D by Vconf -m prep SDfile
Find this compound or compounds like it in BindingDB:
Activity Spreadsheet -- Enzyme Inhibition Constant Data from BindingDB
Found 1 hit for monomerid = 50198902
TargetPeptidyl-prolyl cis-trans isomerase A(Homo sapiens (Human))
Astrazeneca
Curated by ChEMBL
LigandPNGBDBM50198902(CHEMBL3912651)
Affinity DataKd:  1.05E+4nM. Assay description: Inhibition of fluorescent cyclosporin A binding to human CypA by TR-FRET assay
In DepthDetails ArticlePubMed