BDBM50199016 4-chloro-N-[2-(2-chlorophenyl)-5,7-dihydroxy-4-oxo-4H-chromen-8-yl]benzamide::CHEMBL224171
SMILES Oc1cc(O)c2c(oc(cc2=O)-c2ccccc2Cl)c1NC(=O)c1ccc(Cl)cc1
InChI Key InChIKey=ACYJTSCCFDMXDK-UHFFFAOYSA-N
Data  1 IC50
  Tab Delimited (TSV)   2D SDfile   Computed 3D by Vconf -m prep SDfile
Find this compound or compounds like it in BindingDB:
Activity Spreadsheet -- Enzyme Inhibition Constant Data from BindingDB
Found 1 hit for monomerid = 50199016
TargetCyclin-A1/Cyclin-A2/Cyclin-dependent kinase 2(Homo sapiens (Human))
University Of Kansas
Curated by ChEMBL
LigandPNGBDBM50199016(4-chloro-N-[2-(2-chlorophenyl)-5,7-dihydroxy-4-oxo...)
Affinity DataIC50:  3.39E+5nM. Assay description: Inhibition of CDK2/Cyclin A
In DepthDetails ArticlePubMed