BDBM50199204 6-(4-chlorophenyl)-3-{(2R)-2-[(dimethylamino)methyl]-2,3-dihydro-1,4-benzodioxin-6-yl}thieno[3,2-d]pyrimidin-4-(3H)-one::CHEMBL214663
SMILES CN(C)C[C@@H]1COc2cc(ccc2O1)-n1cnc2cc(sc2c1=O)-c1ccc(Cl)cc1
InChI Key InChIKey=WWPGTYXGCMWETG-QGZVFWFLSA-N
Data  1 IC50
  Tab Delimited (TSV)   2D SDfile   Computed 3D by Vconf -m prep SDfile
Find this compound or compounds like it in BindingDB:
Activity Spreadsheet -- Enzyme Inhibition Constant Data from BindingDB
Found 1 hit for monomerid = 50199204
TargetMelanin-concentrating hormone receptor 1(Homo sapiens (Human))
Glaxosmithkline
Curated by ChEMBL
LigandPNGBDBM50199204(6-(4-chlorophenyl)-3-{(2R)-2-[(dimethylamino)methy...)
Affinity DataIC50:  3.20nM. Assay description: Antagonist activity against human MCHR1 expressed in CHO cells by Gal4/Elk1-Luc reporter assay
In DepthDetails ArticlePubMed