BDBM50199227 6-(4-chlorophenyl)-3-[2-[(dimethylamino)methyl]-4-(methylsulfonyl)-3,4-dihydro-2H-1,4-benzoxazin-6-yl]thieno[3,2-d]pyrimidin-4(3H)-one::CHEMBL216008
SMILES CN(C)CC1CN(c2cc(ccc2O1)-n1cnc2cc(sc2c1=O)-c1ccc(Cl)cc1)S(C)(=O)=O
InChI Key InChIKey=RPLIABNAPYWRLH-UHFFFAOYSA-N
Data  1 IC50
  Tab Delimited (TSV)   2D SDfile   Computed 3D by Vconf -m prep SDfile
Find this compound or compounds like it in BindingDB:
Activity Spreadsheet -- Enzyme Inhibition Constant Data from BindingDB
Found 1 hit for monomerid = 50199227
TargetMelanin-concentrating hormone receptor 1(Homo sapiens (Human))
Glaxosmithkline
Curated by ChEMBL
LigandPNGBDBM50199227(6-(4-chlorophenyl)-3-[2-[(dimethylamino)methyl]-4-...)
Affinity DataIC50:  4.17E+3nM. Assay description: Antagonist activity against human MCHR1 expressed in CHO cells by Gal4/Elk1-Luc reporter assay
In DepthDetails ArticlePubMed