BDBM50199242 6-(4-cyano)-3-[2-(4-morpholinylmethyl)-6-quinolinyl]thieno-[3,2-d]pyrimidin-4(3H)-one::CHEMBL218031
SMILES O=c1n(cnc2cc(sc12)-c1ccc(cc1)C#N)-c1ccc2nc(CN3CCOCC3)ccc2c1
InChI Key InChIKey=USYINAXJRSQZMB-UHFFFAOYSA-N
Data  1 IC50
  Tab Delimited (TSV)   2D SDfile   Computed 3D by Vconf -m prep SDfile
Find this compound or compounds like it in BindingDB:
Activity Spreadsheet -- Enzyme Inhibition Constant Data from BindingDB
Found 1 hit for monomerid = 50199242
TargetMelanin-concentrating hormone receptor 1(Homo sapiens (Human))
Glaxosmithkline
Curated by ChEMBL
LigandPNGBDBM50199242(6-(4-cyano)-3-[2-(4-morpholinylmethyl)-6-quinoliny...)
Affinity DataIC50:  478nM. Assay description: Antagonist activity against human MCHR1 expressed in CHO cells by Gal4/Elk1-Luc reporter assay
In DepthDetails ArticlePubMed