BDBM50199250 6-[6-(4-chlorophenyl)-4-oxothieno[3,2-d]pyrimidin-3(4H)-yl]-N-[3-(1-pyrrolidinyl)propyl]-2-naphthalenecarboxamide::CHEMBL214571
SMILES Clc1ccc(cc1)-c1cc2ncn(-c3ccc4cc(ccc4c3)C(=O)NCCCN3CCCC3)c(=O)c2s1
InChI Key InChIKey=KTUUGIXLHKSABH-UHFFFAOYSA-N
Data  1 IC50
  Tab Delimited (TSV)   2D SDfile   Computed 3D by Vconf -m prep SDfile
Find this compound or compounds like it in BindingDB:
Activity Spreadsheet -- Enzyme Inhibition Constant Data from BindingDB
Found 1 hit for monomerid = 50199250
TargetMelanin-concentrating hormone receptor 1(Homo sapiens (Human))
Glaxosmithkline
Curated by ChEMBL
LigandPNGBDBM50199250(6-[6-(4-chlorophenyl)-4-oxothieno[3,2-d]pyrimidin-...)
Affinity DataIC50:  1.41E+3nM. Assay description: Antagonist activity against human MCH1 receptor stably-expressed in CHO cells by Gal4/Elk1-Luc reporter assay
In DepthDetails ArticlePubMed