BDBM50199274 3-noradamantyl-1,3-dipropylxanthine::CHEMBL385372
SMILES CCCn1c2[nH]c(nc2c(=O)n(CCC)c1=O)C12CC3CC(CC3C1)C2
InChI Key InChIKey=IDHJABAMUQNMKF-UHFFFAOYSA-N
Data  4 KI
  Tab Delimited (TSV)   2D SDfile   Computed 3D by Vconf -m prep SDfile
Find this compound or compounds like it in BindingDB:
Activity Spreadsheet -- Enzyme Inhibition Constant Data from BindingDB
Found 4 hits for monomerid = 50199274
TargetAdenosine receptor A1(Homo sapiens (Human))
Biogen Idec
Curated by ChEMBL
LigandPNGBDBM50199274(3-noradamantyl-1,3-dipropylxanthine | CHEMBL385372)
Affinity DataKi:  8nM. Assay description: Displacement of [125I]ABA from human adenosine A1 receptor expressed in CHOK1 cells
In DepthDetails ArticlePubMed
TargetAdenosine receptor A2b(Homo sapiens (Human))
Biogen Idec
Curated by ChEMBL
LigandPNGBDBM50199274(3-noradamantyl-1,3-dipropylxanthine | CHEMBL385372)
Affinity DataKi:  296nM. Assay description: Displacement of [125I]3-(4-aminobenzyl)-8-phenyloxyacetate-1-propyl-xanthine from human adenosine A2B receptor expressed in HEK cells
In DepthDetails ArticlePubMed
TargetAdenosine receptor A2a(Homo sapiens (Human))
Biogen Idec
Curated by ChEMBL
LigandPNGBDBM50199274(3-noradamantyl-1,3-dipropylxanthine | CHEMBL385372)
Affinity DataKi:  673nM. Assay description: Displacement of [125I]ZM241385 from human adenosine A2A receptor expressed in HEK cells
In DepthDetails ArticlePubMed
TargetAdenosine receptor A3(Homo sapiens (Human))
Biogen Idec
Curated by ChEMBL
LigandPNGBDBM50199274(3-noradamantyl-1,3-dipropylxanthine | CHEMBL385372)
Affinity DataKi:  4.39E+3nM. Assay description: Displacement of [125I]ABA from human adenosine A3 receptor expressed in HEK cells
In DepthDetails ArticlePubMed